{"text_format":"1","workbook":"xlsx","n_sheets":3,"sheets":["Non-Lighting Rebate Estimator","Lookups","Incremental Cost"],"not_rendered":{"charts":0,"images":1,"macros":1,"external_links":0,"defined_names":11,"comments":3,"pivot_tables":0},"unopened":[],"bounds":{"document_bytes":16777216,"sheet_cells":100000,"rows_first":2000,"rows_last":500,"rows_between":2000,"halvings":0,"cell_chars":16384,"cell_head_chars":4096},"cells_cut":0,"cells_raw":0,"read":"whole","date_system":"1900"}

{"sheet":"Non-Lighting Rebate Estimator","index":0,"n_rows":66,"n_cols":26,"rows_kept":66,"cut":false,"hidden":false,"merged":[[65,0,65,25],[64,16,64,20],[7,19,7,20],[9,19,9,20],[26,25,45,25],[64,0,64,15],[7,14,7,18],[61,4,61,13],[62,19,63,19],[62,20,63,20],[62,21,63,21],[62,25,63,25],[62,4,63,12],[62,23,63,23],[47,4,47,13],[3,0,6,0],[3,14,3,18],[5,14,5,18],[62,0,63,0],[62,1,63,1],[62,2,63,2],[62,3,63,3],[62,16,63,16],[62,17,63,17],[62,18,63,18],[53,4,53,13],[9,14,9,18],[7,0,9,0],[3,4,9,10]]}
[null,null,null,null,null,null,null,null,null,null,null,null,null,null,null,null,null,null,null,null,null,null,null,null,null,"Business Name"]
[]
[null,null,null,null,null,null,null,null,null,null,null,null,null,null,null,null,null,null,null,null,null,null,null,null,null,"Address (Street / City / State / Zip Code)"]
[null,null,null,null,"HVAC \nRebate Estimator\nLast Revised 1/1/2018",null,null,null,null,null,null,null,null,null,"Enter Total Project Costs \n(for items receiving rebates - including tax)"]
[null,null,null,null,null,null,null,null,null,null,null,null,null,null,null,null,null,null,null,null,null,null,null,null,null,"Contact Name"]
[null,null,null,null,null,null,null,null,null,null,null,null,null,null,"Enter Expected Utility Rebates"]
[null,null,null,null,null,null,null,null,null,null,null,null,null,null,null,null,null,null,null,null,null,null,null,null,null,"Phone"]
[null,null,null,null,null,null,null,null,null,null,null,null,null,null,"PACE Rebate Limit \n(50% of Project Costs minus Utility Rebates)",null,null,null,null,{"$f":"IF(IF((0.5*T4-T6)<5000,(0.5*T4-T6),5000)<0,0.000001,(IF((0.5*T4-T6)<5000,(0.5*T4-T6),5000)))","v":0}]
[null,null,null,null,null,null,null,null,null,null,null,null,null,null,null,null,null,null,null,null,null,null,null,null,null,"Email"]
[null,null,null,null,null,null,null,null,null,null,null,null,null,null," Estimated PACE Rebate Amount ",null,null,null,null,{"$f":"IFERROR(IF(V65>T8,T8,V65),\"\")","v":0}]
[]
["Measures","# of Units Being Rebated","Building Type","Equipment Capacity","Equipment Capacity Unit","Efficient Equipment Efficiency","Efficient RTU with Economizer?","Is the Existing Unit Operable?","Existing Equipment Efficiency","Existing Equipment Efficiency - Final","Equipment Efficiency Unit","Existing Equipment Installed Date ","Existing Equipment Install Date Range","EFLH","Calculated Savings","Calculated Savings Unit","Deemed Savings","Deemed Savings Units","PACE Rebate","Rebate Units","Capacity Units","PACE Reward","$/ ton GHG-saved (PACE Rebate) ","Xcel Rebate","$/ ton GHG-saved (ES+Xcel Rebate) ","Specifications"]
["Heating"]
[null,null,null,null,null,null,null,null,null,null,null,null,null,null,null,null,null,null,null,null,"kBTU",null,"$/metric ton",null,"$/metric ton"]
["Boiler, minimum 92% AFUE",null,null,null,"kBTU",null,"n/a",null,null,{"$f":"IFERROR(IF(I15=\"\",VLOOKUP(M15,Baseline_Eff_lookup,2,FALSE),I15),\"\")","v":""},"EFF %",null,{"$f":"IFERROR(VLOOKUP(L15,DateRange_lookup,2,FALSE),\"\")","v":""},{"$f":"IFERROR(VLOOKUP(C15,EFLH_lookup,3,FALSE),\"\")","v":""},{"$f":"IFERROR(((((D15*1000)*F15/(IF(H15=\"yes\",J15*(1-Lookups!$I$10)^(2016-'Non-Lighting Rebate Estimator'!L15),Lookups!$B$30)))-(D15*1000))*N15/1000000)*B15,\"\")","v":""},"dekatherms/ unit",510.3,"kWh/million btu",{"$f":"IF(H15=\"yes\",IF(F15=\"\",'Incremental Cost'!$M$11,IF(F15=92%,'Incremental Cost'!$M$11,('Incremental Cost'!$M$11+('Incremental Cost'!$Q4*((F15-92%)*100))))),IF(F15=\"\",'Incremental Cost'!$L$11,IF(F15=92%,'Incremental Cost'!$L$11,('Incremental Cost'!$L$11+('Incremental Cost'!$Q4*((F15-92%)*100))))))","v":2.5},"$/kBTU",{"$f":"D15","v":0},{"$f":"IF((U15*S15)*B15>5000,5000,(U15*S15)*B15)","v":0},{"$f":"IFERROR(V15/((O15*10)*Lookups!$M$4),\"\")","v":""},{"$f":"IFERROR(U15*'Incremental Cost'!$K$11,\"\")","v":0},{"$f":"IFERROR((V15+X15)/(O15*10*Lookups!$M$4),\"\")","v":""},"• Condensing hot water boilers for space heating and domestic water only\n• Rebates for new equipment replacing currently operating & inoperable equipment \n• Equipment must use natural-gas fuel \n• Boilers must meet minimum efficiency of 92% AFUE \n• Back-up equipment not eligible for rebates \n• Customer must provide CO State inspection report with application"]
{"$rows_left_out":52}
{"sheet":"Lookups","index":1,"n_rows":123,"n_cols":18,"rows_kept":123,"cut":false,"hidden":true,"merged":[[1,11,1,12],[1,7,1,9],[20,0,20,13],[64,9,64,12],[96,0,96,3],[22,0,22,2],[22,4,22,13],[30,0,30,1],[33,0,33,7],[60,0,60,3],[76,0,76,3],[35,0,35,3],[41,0,41,3],[45,0,45,3],[65,3,65,5]]}
["Building Type Lookup values"]
["Building Type","Cooling EFLH","Heating EFLH","Fan Operating Hours","EnergySmart Operating Hours",null,null,"Degredation Efficiency:",null,null,null,"Greenhouse Gas Energy Conversion",null,null,null,null,"Install Year","Date Range"]
["Office",868,369,3706,3435,null,null,"From \"Building American Performance Analysis Procedures for Existing Homes\". NREL. May 2006 pgs. 6-14",null,null,null,"kWh to ton of GHG",8.0000000000000004E-4,null,null,null,1920,"Pre 1980"]
["Large Retail",1214,544,5000,4912,null,null,"http://www.nrel.gov/buildings/pdfs/38238.pdf",null,null,null,"therm to ton of GHG",5.3200000000000001E-3,null,null,null,1921,"Pre 1980"]
["Small Retail",860,287,3242,3068,null,null,"Boiler Degradation Equation:","(Base AFUE)*(1-M)^age",null,null,null,null,null,null,null,1922,"Pre 1980"]
["Grocery",1186,482,4777,4612,null,null,"DX Degradation Equation:","(Base Eff)*(1-M)^age",null,null,null,null,null,null,null,1923,"Pre 1980"]
["Restaurant",1094,420,4182,4156,null,null,"Base AFUE: Typical Efficiency of Pre-Retrofit","See Table 5",null,null,null,null,null,null,null,1924,"Pre 1980"]
["Lodging",801,235,2835,2697,null,null,"Base EFF: Pre-retrofit equipment","Original SEER/EER Value",null,null,null,null,null,null,null,1925,"Pre 1980"]
["Healthcare",856,355,3555,3392,null,null,"M: Maintanace Factor (DX)",0.01,null,null,null,null,null,null,null,1926,"Pre 1980"]
["Education",307,253,2264,2080,null,null,"M: Maintanace Factor (Furnace/Boiler)",{"$f":"AVERAGE(J12:J16)","v":5.0000000000000001E-3},null,null,null,null,null,null,null,1927,"Pre 1980"]
["Public Service",868,369,3706,{"$f":"E3","v":3435},null,null,"Table 5: Space Heating Equipment","Base AFUE","Maintanence Factor",null,null,null,null,null,null,1928,"Pre 1980"]
["Churches",790,286,3111,2912,null,null,"Condensing Gas Furnace",90,5.0000000000000001E-3,null,null,null,null,null,null,1929,"Pre 1980"]
["Warehouse",1314,709,5959,5913,null,null,"Gas Furnace, direct vent",80,5.0000000000000001E-3,null,null,null,null,null,null,1930,"Pre 1980"]
["Other Commercial Buildings",660,211,2658,2278,null,null,"Gas Furnace, natural draft",78,5.0000000000000001E-3,null,null,null,null,null,null,1931,"Pre 1980"]
["Heavy Industrial",1336,689,5957,5913,null,null,"Gas hot water boiler, natural draft",80,5.0000000000000001E-3,null,null,null,null,null,null,1932,"Pre 1980"]
{"$rows_left_out":109}
{"sheet":"Incremental Cost","index":2,"n_rows":94,"n_cols":20,"rows_kept":94,"cut":false,"hidden":true,"merged":[[68,6,68,9],[1,7,1,8],[0,0,0,4],[12,0,12,4],[26,0,26,4],[1,3,1,6],[20,0,20,1],[21,0,21,1],[22,0,22,1],[23,0,23,1],[19,0,19,1],[1,0,1,2],[15,0,15,1],[14,0,14,1],[88,0,88,4],[13,3,13,5],[35,1,35,5],[36,1,36,5],[51,0,51,4],[68,0,68,4],[18,0,18,1],[17,0,17,1],[16,0,16,1]]}
["Table: Hot Water Boiler Cost",null,null,null,null,null,null,null,null,null,"http://www.xcelenergy.com/Energy_Solutions/Business_Solutions/Rebates_&_Energy_Savings/Heating_Efficiency"]
[null,null,null,"Non-Condensing",null,null,null,"Condensing",null,"Incremental ($/kbtu)","Xcel Rebate ($/kbtu)","Boulder Rebate ($/kbtu) - Replace on Burnout","Boulder Rebate ($/kbtu) - Early Replacement"]
["Boiler Nameplate Capacity","kBTU",null,"Baseline - Cost","Baseline Eff. (EFFb)","High Efficient Non Condensing - Cost","High Efficient Non Condensing - Efficiency (EFFh)","High Efficient Condensing - Cost","High Efficient Condensing - Efficiency Cost/kbtu","Baseline to High Efficient - Condensing",null,null,null,null,null,"Bonus Rebate Scaling Factor","Bonus Rebate ($/kbtu)","Min. Efficiency Savings (dekatherms)","Actual Efficiency Savings (dekatherms)","$/GHG Saved (Xcel + ES)"]
["175,000 Btu/hr",175,null,3000,0.8,3500,0.85,4600,{"$f":"H4/B4","v":26.285714285714285},{"$f":"(H4-D4)/B4","v":9.1428571428571423},null,null,null,null,"Boiler, minimum 92% AFUE",1,{"$f":"IFERROR((((S4-R4)*10)*Lookups!$M$4*T4)/'Non-Lighting Rebate Estimator'!$U15*P4,0)","v":0},{"$f":"IFERROR((((('Non-Lighting Rebate Estimator'!$D15*1000)*92%/(IF('Non-Lighting Rebate Estimator'!$H15=\"yes\",'Non-Lighting Rebate Estimator'!$J15*(1-Lookups!$I$10)^(2016-'Non-Lighting Rebate Estimator'!$L15),Lookups!$B$30)))-('Non-Lighting Rebate Estimator'!$D15*1000))*'Non-Lighting Rebate Estimator'!$N15/1000000)*'Non-Lighting Rebate Estimator'!$B15,\"\")","v":""},{"$f":"IFERROR((((('Non-Lighting Rebate Estimator'!$D15*1000)*'Non-Lighting Rebate Estimator'!$F15/(IF('Non-Lighting Rebate Estimator'!$H15=\"yes\",'Non-Lighting Rebate Estimator'!$J15*(1-Lookups!$I$10)^(2016-'Non-Lighting Rebate Estimator'!$L15),Lookups!$B$30)))-('Non-Lighting Rebate Estimator'!$D15*1000))*'Non-Lighting Rebate Estimator'!$N15/1000000)*'Non-Lighting Rebate Estimator'!$B15,\"\")","v":""},{"$f":"(IF('Non-Lighting Rebate Estimator'!$H15=\"yes\",'Incremental Cost'!$M$11*'Non-Lighting Rebate Estimator'!$U15,'Incremental Cost'!$L$11*'Non-Lighting Rebate Estimator'!$U15)+'Non-Lighting Rebate Estimator'!$X15)/(('Non-Lighting Rebate Estimator'!$O15*10)*Lookups!$M$4)","v":{"$error":"#VALUE!"}}]
["500,000 Btu/hr",500,null,5000,0.8,9000,0.85,11200,{"$f":"H5/B5","v":22.4},12.4,null,null,null,null,"Boiler, minimum 92% AFUE",1,{"$f":"IFERROR((((S5-R5)*10)*Lookups!$M$4*T5)/'Non-Lighting Rebate Estimator'!$U16*P5,0)","v":0},{"$f":"IFERROR((((('Non-Lighting Rebate Estimator'!$D16*1000)*92%/(IF('Non-Lighting Rebate Estimator'!$H16=\"yes\",'Non-Lighting Rebate Estimator'!$J16*(1-Lookups!$I$10)^(2016-'Non-Lighting Rebate Estimator'!$L16),Lookups!$B$30)))-('Non-Lighting Rebate Estimator'!$D16*1000))*'Non-Lighting Rebate Estimator'!$N16/1000000)*'Non-Lighting Rebate Estimator'!$B16,\"\")","v":""},{"$f":"IFERROR((((('Non-Lighting Rebate Estimator'!$D16*1000)*'Non-Lighting Rebate Estimator'!$F16/(IF('Non-Lighting Rebate Estimator'!$H16=\"yes\",'Non-Lighting Rebate Estimator'!$J16*(1-Lookups!$I$10)^(2016-'Non-Lighting Rebate Estimator'!$L16),Lookups!$B$30)))-('Non-Lighting Rebate Estimator'!$D16*1000))*'Non-Lighting Rebate Estimator'!$N16/1000000)*'Non-Lighting Rebate Estimator'!$B16,\"\")","v":""},{"$f":"(IF('Non-Lighting Rebate Estimator'!$H16=\"yes\",'Incremental Cost'!$M$11*'Non-Lighting Rebate Estimator'!$U16,'Incremental Cost'!$L$11*'Non-Lighting Rebate Estimator'!$U16)+'Non-Lighting Rebate Estimator'!$X16)/(('Non-Lighting Rebate Estimator'!$O16*10)*Lookups!$M$4)","v":{"$error":"#VALUE!"}}]
["1,000,000 Btu/hr",1000,null,7300,0.8,11700,0.85,15000,15,7.7,null,null,null,null,"Boiler, minimum 92% AFUE",1,{"$f":"IFERROR((((S6-R6)*10)*Lookups!$M$4*T6)/'Non-Lighting Rebate Estimator'!$U17*P6,0)","v":0},{"$f":"IFERROR((((('Non-Lighting Rebate Estimator'!$D17*1000)*92%/(IF('Non-Lighting Rebate Estimator'!$H17=\"yes\",'Non-Lighting Rebate Estimator'!$J17*(1-Lookups!$I$10)^(2016-'Non-Lighting Rebate Estimator'!$L17),Lookups!$B$30)))-('Non-Lighting Rebate Estimator'!$D17*1000))*'Non-Lighting Rebate Estimator'!$N17/1000000)*'Non-Lighting Rebate Estimator'!$B17,\"\")","v":""},{"$f":"IFERROR((((('Non-Lighting Rebate Estimator'!$D17*1000)*'Non-Lighting Rebate Estimator'!$F17/(IF('Non-Lighting Rebate Estimator'!$H17=\"yes\",'Non-Lighting Rebate Estimator'!$J17*(1-Lookups!$I$10)^(2016-'Non-Lighting Rebate Estimator'!$L17),Lookups!$B$30)))-('Non-Lighting Rebate Estimator'!$D17*1000))*'Non-Lighting Rebate Estimator'!$N17/1000000)*'Non-Lighting Rebate Estimator'!$B17,\"\")","v":""},{"$f":"(IF('Non-Lighting Rebate Estimator'!$H17=\"yes\",'Incremental Cost'!$M$11*'Non-Lighting Rebate Estimator'!$U17,'Incremental Cost'!$L$11*'Non-Lighting Rebate Estimator'!$U17)+'Non-Lighting Rebate Estimator'!$X17)/(('Non-Lighting Rebate Estimator'!$O17*10)*Lookups!$M$4)","v":{"$error":"#VALUE!"}}]
["2,000,000 Btu/hr",2000,null,12000,0.8,17000,0.85,26500,13.25,7.25,null,null,null,null,"Boiler, minimum 92% AFUE",1,{"$f":"IFERROR((((S7-R7)*10)*Lookups!$M$4*T7)/'Non-Lighting Rebate Estimator'!$U18*P7,0)","v":0},{"$f":"IFERROR((((('Non-Lighting Rebate Estimator'!$D18*1000)*92%/(IF('Non-Lighting Rebate Estimator'!$H18=\"yes\",'Non-Lighting Rebate Estimator'!$J18*(1-Lookups!$I$10)^(2016-'Non-Lighting Rebate Estimator'!$L18),Lookups!$B$30)))-('Non-Lighting Rebate Estimator'!$D18*1000))*'Non-Lighting Rebate Estimator'!$N18/1000000)*'Non-Lighting Rebate Estimator'!$B18,\"\")","v":""},{"$f":"IFERROR((((('Non-Lighting Rebate Estimator'!$D18*1000)*'Non-Lighting Rebate Estimator'!$F18/(IF('Non-Lighting Rebate Estimator'!$H18=\"yes\",'Non-Lighting Rebate Estimator'!$J18*(1-Lookups!$I$10)^(2016-'Non-Lighting Rebate Estimator'!$L18),Lookups!$B$30)))-('Non-Lighting Rebate Estimator'!$D18*1000))*'Non-Lighting Rebate Estimator'!$N18/1000000)*'Non-Lighting Rebate Estimator'!$B18,\"\")","v":""},{"$f":"(IF('Non-Lighting Rebate Estimator'!$H18=\"yes\",'Incremental Cost'!$M$11*'Non-Lighting Rebate Estimator'!$U18,'Incremental Cost'!$L$11*'Non-Lighting Rebate Estimator'!$U18)+'Non-Lighting Rebate Estimator'!$X18)/(('Non-Lighting Rebate Estimator'!$O18*10)*Lookups!$M$4)","v":{"$error":"#VALUE!"}}]
["4,000,000 Btu/hr",4000,null,24000,0.8,34000,0.85,53000,13.25,7.25,null,null,null,null,"Boiler, minimum 92% AFUE",1,{"$f":"IFERROR((((S8-R8)*10)*Lookups!$M$4*T8)/'Non-Lighting Rebate Estimator'!$U19*P8,0)","v":0},{"$f":"IFERROR((((('Non-Lighting Rebate Estimator'!$D19*1000)*92%/(IF('Non-Lighting Rebate Estimator'!$H19=\"yes\",'Non-Lighting Rebate Estimator'!$J19*(1-Lookups!$I$10)^(2016-'Non-Lighting Rebate Estimator'!$L19),Lookups!$B$30)))-('Non-Lighting Rebate Estimator'!$D19*1000))*'Non-Lighting Rebate Estimator'!$N19/1000000)*'Non-Lighting Rebate Estimator'!$B19,\"\")","v":""},{"$f":"IFERROR((((('Non-Lighting Rebate Estimator'!$D19*1000)*'Non-Lighting Rebate Estimator'!$F19/(IF('Non-Lighting Rebate Estimator'!$H19=\"yes\",'Non-Lighting Rebate Estimator'!$J19*(1-Lookups!$I$10)^(2016-'Non-Lighting Rebate Estimator'!$L19),Lookups!$B$30)))-('Non-Lighting Rebate Estimator'!$D19*1000))*'Non-Lighting Rebate Estimator'!$N19/1000000)*'Non-Lighting Rebate Estimator'!$B19,\"\")","v":""},{"$f":"(IF('Non-Lighting Rebate Estimator'!$H19=\"yes\",'Incremental Cost'!$M$11*'Non-Lighting Rebate Estimator'!$U19,'Incremental Cost'!$L$11*'Non-Lighting Rebate Estimator'!$U19)+'Non-Lighting Rebate Estimator'!$X19)/(('Non-Lighting Rebate Estimator'!$O19*10)*Lookups!$M$4)","v":{"$error":"#VALUE!"}}]
["6,000,000 Btu/hr",6000,null,36000,0.8,51000,0.85,79500,13.25,7.25]
["8,000,000 Btu/hr",8000,null,48000,0.8,68000,0.85,106000,13.25,7.25]
[null,null,null,null,null,null,null,"Average Cost",{"$f":"AVERAGE(I4:I10)","v":16.66938775510204},{"$f":"AVERAGE(J4:J10)","v":8.3204081632653075},3.5,2.5,3]
[]
["Table: Commercial Furnace"]
[null,null,null,"Furnace Cost",null,null,"http://www.xcelenergy.com/Energy_Solutions/Business_Solutions/Rebates_&_Energy_Savings/Heating_Efficiency"]
["Btu Input",null,"Full Cost (92% Furnace)","Btu Input","80% Furnace","Incremental Cost","Xcel Rebate","Boulder Rebate ($/unit) - Replace on Burnout","Boulder Rebate ($/unit) - Early Replacement",null,null,"Bonus Rebate Scaling Factor","Bonus Rebate ($/unit)","Min. Efficiency Savings (dekatherms)","Actual Efficiency Savings (dekatherms)","$/GHG Saved (Xcel + ES)"]
{"$rows_left_out":79}